Target
D(2) dopamine receptor
Ligand
BDBM50474413
Substrate
Meas. Tech.
ChEMBL_60540 (CHEMBL674348)
Ki
158±n/a nM
Citation
 Macdonald, GJBranch, CLHadley, MSJohnson, CNNash, DJSmith, ABStemp, GThewlis, KMVong, AKAustin, NEJeffrey, PWinborn, KYBoyfield, IHagan, JJMiddlemiss, DNReavill, CRiley, GJWatson, JMWood, MParker, SGAshby, CR Design and synthesis of trans-3-(2-(4-((3-(3-(5-methyl-1,2,4-oxadiazolyl))- phenyl)carboxamido)cyclohexyl)ethyl)-7-methylsulfonyl-2,3,4,5-tetrahydro-1H-3-benzazepine (SB-414796): a potent and selective dopamine D3 receptor antagonist. J Med Chem 46:4952-64 (2003)  
Target
Name:
D(2) dopamine receptor
Synonyms:
D(2) dopamine receptor DOPAMINE D2 Long DRD2 Dopamine D2 receptor Dopamine D2 receptor (D2R) Dopamine2-like | d2
Type:
Cell-surface receptors
Mol. Mass.:
50647.10
Organism:
Homo sapiens (Human)
Description:
P14416
Residue:
443
  
Inhibitor
Name:
BDBM50474413
Synonyms:
CHEMBL3084626
Type:
Small organic molecule
Emp. Form.:
C30H38ClN3O5S
Mol. Mass.:
588.158
SMILES:
Cl.Cc1cc(on1)-c1cccc(c1)C(=O)N[C@H]1CC[C@H](CCN2CCc3ccc(OS(C)(=O)=O)cc3CC2)CC1
: