Target
Corticosteroid-binding globulin
Ligand
BDBM50423511
Substrate
Meas. Tech.
ChEMBL_48199 (CHEMBL665995)
Ki
18±n/a nM
Citation
 Kotani, THigashiura, K Comparative molecular active site analysis (CoMASA). 1. An approach to rapid evaluation of 3D QSAR. J Med Chem 47:2732-42 (2004)  
Target
Name:
Corticosteroid-binding globulin
Synonyms:
CBG Corticosteroid binding globulin | SERPINA6
Type:
PROTEIN
Mol. Mass.:
45136.82
Organism:
Homo sapiens
Description:
ChEMBL_10503
Residue:
405
  
Inhibitor
Name:
BDBM50423511
Synonyms:
Delalutin | HYDROXYPROGESTERONE
Type:
Small organic molecule
Emp. Form.:
C21H30O3
Mol. Mass.:
330.4611
SMILES:
CC(=O)[C@@]1(O)CC[C@H]2[C@@H]3CCC4=CC(=O)CC[C@]4(C)[C@H]3CC[C@]12C
: