Target
5-hydroxytryptamine receptor 1A
Ligand
BDBM50412114
Substrate
Meas. Tech.
ChEMBL_304067 (CHEMBL839742)
Ki
0.316228±n/a nM
Citation
 Atkinson, PJBromidge, SMDuxon, MSGaster, LMHadley, MSHammond, BJohnson, CNMiddlemiss, DNNorth, SEPrice, GWRami, HKRiley, GJScott, CMShaw, TEStarr, KRStemp, GThewlis, KMThomas, DRThompson, MVong, AKWatson, JM 3,4-Dihydro-2H-benzoxazinones are 5-HT(1A) receptor antagonists with potent 5-HT reuptake inhibitory activity. Bioorg Med Chem Lett 15:737-41 (2005)  
Target
Name:
5-hydroxytryptamine receptor 1A
Synonyms:
5-HT-1A 5-hydroxytryptamine receptor 1A (5-HT-1A) ADRB2RL1 Dopamine D2 receptor and serotonin 1a receptor HTR1A | Serotonin receptor 1A
Type:
Mol. Mass.:
46122.49
Organism:
Homo sapiens (Human)
Description:
Residue:
422
  
Inhibitor
Name:
BDBM50412114
Synonyms:
CHEMBL183460 | SB-649915
Type:
Small organic molecule
Emp. Form.:
C26H29N3O3
Mol. Mass.:
431.5268
SMILES:
Cc1ccc2c(OCCN3CCC(Cc4ccc5OCC(=O)Nc5c4)CC3)cccc2n1
: