Target
Androgen receptor
Ligand
BDBM50475269
Substrate
Meas. Tech.
ChEMBL_304043 (CHEMBL877110)
Ki
2.6±n/a nM
Citation
 Söderholm, AALehtovuori, PTNyrönen, TH Three-dimensional structure-activity relationships of nonsteroidal ligands in complex with androgen receptor ligand-binding domain. J Med Chem 48:917-25 (2005)  
Target
Name:
Androgen receptor
Synonyms:
ANDR_RAT Ar Nr3c4 | androgen
Type:
Enzyme
Mol. Mass.:
98219.08
Organism:
Rattus norvegicus (Rat)
Description:
P15207
Residue:
902
  
Inhibitor
Name:
BDBM50475269
Synonyms:
CHEMBL126154
Type:
Small organic molecule
Emp. Form.:
C19H15F6N3O5S
Mol. Mass.:
511.395
SMILES:
C[C@](O)(CSc1ccc(NC(=O)C(F)(F)F)cc1)C(=O)Nc1ccc(c(c1)C(F)(F)F)[N+]([O-])=O
: