Target
Androgen receptor
Ligand
BDBM50091400
Substrate
Meas. Tech.
ChEMBL_304043 (CHEMBL877110)
Ki
2.2±n/a nM
Citation
 Söderholm, AALehtovuori, PTNyrönen, TH Three-dimensional structure-activity relationships of nonsteroidal ligands in complex with androgen receptor ligand-binding domain. J Med Chem 48:917-25 (2005)  
Target
Name:
Androgen receptor
Synonyms:
ANDR_RAT Ar Nr3c4 | androgen
Type:
Enzyme
Mol. Mass.:
98219.08
Organism:
Rattus norvegicus (Rat)
Description:
P15207
Residue:
902
  
Inhibitor
Name:
BDBM50091400
Synonyms:
4-(3-(4-hydroxybutyl)-4,4-dimethyl-5-oxo-2-thioxoimidazolidin-1-yl)-2-(trifluoromethyl)benzonitrile CHEMBL331820 | RU-59063
Type:
Small organic molecule
Emp. Form.:
C17H18F3N3O2S
Mol. Mass.:
385.404
SMILES:
CC1(C)N(CCCCO)C(=S)N(C1=O)c1ccc(C#N)c(c1)C(F)(F)F
: