Target
Albumin
Ligand
BDBM13066
Substrate
Meas. Tech.
ChEMBL_307324 (CHEMBL835062)
Ki
331000±n/a nM
Citation
 Aureli, LCruciani, GCesta, MCAnacardio, RDe Simone, LMoriconi, A Predicting human serum albumin affinity of interleukin-8 (CXCL8) inhibitors by 3D-QSPR approach. J Med Chem 48:2469-79 (2005)  
Target
Name:
Albumin
Synonyms:
ALB Serum albumin
Type:
PROTEIN
Mol. Mass.:
69362.94
Organism:
Homo sapiens (Human)
Description:
ChEMBL_1509401
Residue:
609
  
Inhibitor
Name:
BDBM13066
Synonyms:
2-{2-[(2,6-dichlorophenyl)amino]phenyl}acetic acid Diclofenac US11478464, Compound Diclofenac {2-[(2,6-dichlorophenyl)amino]phenyl}acetic acid
Type:
Small organic molecule
Emp. Form.:
C14H11Cl2NO2
Mol. Mass.:
296.149
SMILES:
OC(=O)Cc1ccccc1Nc1c(Cl)cccc1Cl
: