Target
Tubulin beta chain
Ligand
BDBM50035218
Substrate
Meas. Tech.
ChEMBL_422811 (CHEMBL856530)
IC50
350±n/a nM
Citation
 Zuse, ASchmidt, PBaasner, SBöhm, KJMüller, KGerlach, MGünther, EGUnger, EPrinz, H 9-Benzylidene-naphtho[2,3-b]thiophen-4-ones as novel antimicrotubule agents-synthesis, antiproliferative activity, and inhibition of tubulin polymerization. J Med Chem 49:7816-25 (2006)  
Target
Name:
Tubulin beta chain
Synonyms:
Beta-tubulin Tubulin beta chain
Type:
PROTEIN
Mol. Mass.:
49840.26
Organism:
Sus scrofa
Description:
ChEMBL_105107
Residue:
445
  
Inhibitor
Name:
BDBM50035218
Synonyms:
CHEMBL61 Podophyllinic acid lactone podophyllotoxin
Type:
Small organic molecule
Emp. Form.:
C22H22O8
Mol. Mass.:
414.4053
SMILES:
COc1cc(cc(OC)c1OC)[C@H]1[C@@H]2[C@H](COC2=O)[C@@H](O)c2cc3OCOc3cc12
: