Target
DNA topoisomerase 3
Ligand
BDBM50022163
Substrate
Meas. Tech.
ChEBML_54508
Ki
420±n/a nM
Citation
 Wright, GEBrown, NC Inhibitors of Bacillus subtilis DNA polymerase III. 6-Anilinouracils and 6-(alkylamino)uracils. J Med Chem 23:34-8 (1980)  
Target
Name:
DNA topoisomerase 3
Synonyms:
DNA topoisomerase III topB
Type:
PROTEIN
Mol. Mass.:
81515.22
Organism:
Bacillus subtilis
Description:
ChEMBL_54525
Residue:
727
  
Inhibitor
Name:
BDBM50022163
Synonyms:
6-(Indan-5-ylamino)-1H-pyrimidine-2,4-dione | CHEMBL54950
Type:
Small organic molecule
Emp. Form.:
C13H13N3O2
Mol. Mass.:
243.2612
SMILES:
O=c1cc(Nc2ccc3CCCc3c2)[nH]c(=O)[nH]1
: