Target
DNA topoisomerase 2-alpha
Ligand
BDBM23446
Substrate
Meas. Tech.
ChEMBL_480681 (CHEMBL1014697)
IC50
167000±n/a nM
Citation
 Constantinou, AMehta, RRunyan, CRao, KVaughan, AMoon, R Flavonoids as DNA topoisomerase antagonists and poisons: structure-activity relationships. J Nat Prod 58:217-25 (1995)  
Target
Name:
DNA topoisomerase 2-alpha
Synonyms:
DNA topoisomerase 2-alpha DNA topoisomerase II (Topo II) DNA topoisomerase II, alpha isozyme TOP2A Topoisomerase I/II | Topoisomerase II alpha (HuTopoIIα)
Type:
Protein
Mol. Mass.:
174415.30
Organism:
Homo sapiens (Human)
Description:
P11388
Residue:
1531
  
Inhibitor
Name:
BDBM23446
Synonyms:
3-(4-hydroxyphenyl)-1-(2,4,6-trihydroxyphenyl)propan-1-one Phloretin | cid_4788
Type:
Dihydrochalcone
Emp. Form.:
C15H14O5
Mol. Mass.:
274.2687
SMILES:
Oc1ccc(CCC(=O)c2c(O)cc(O)cc2O)cc1
: