Target
Aldo-keto reductase family 1 member B1
Ligand
BDBM50028365
Substrate
Meas. Tech.
ChEBML_31920
Ki
400.0±n/a nM
Citation
 Pfister, JRWymann, WEMahoney, JMWaterbury, LD Synthesis and aldose reductase inhibitory activity of 7-sulfamoylxanthone-2-carboxylic acids. J Med Chem 23:1264-7 (1981)  
Target
Name:
Aldo-keto reductase family 1 member B1
Synonyms:
AKR1B1 ALDR_HUMAN AR Aldose Reductase (ALR2) Aldose reductase (AR)
Type:
Protein
Mol. Mass.:
35855.50
Organism:
Homo sapiens (Human)
Description:
P15121. 4LAU; 2IKI; 4LB4; 2FZD; 2FZ8; 1US0
Residue:
316
  
Inhibitor
Name:
BDBM50028365
Synonyms:
7-Dimethylsulfamoyl-9-oxo-9H-xanthene-2-carboxylic acid | CHEMBL282245
Type:
Small organic molecule
Emp. Form.:
C16H13NO6S
Mol. Mass.:
347.343
SMILES:
CN(C)S(=O)(=O)c1ccc2oc3ccc(cc3c(=O)c2c1)C(O)=O
: