Target
HIV-1 protease
Ligand
BDBM8125
Substrate
Meas. Tech.
ChEMBL_538759 (CHEMBL1024878)
Ki
300±n/a nM
Citation
 Kovalevsky, AYGhosh, AKWeber, IT Solution kinetics measurements suggest HIV-1 protease has two binding sites for darunavir and amprenavir. J Med Chem 51:6599-603 (2008)  
Target
Name:
HIV-1 protease
Synonyms:
HIV-1 protease
Type:
PROTEIN
Mol. Mass.:
10795.19
Organism:
Human immunodeficiency virus
Description:
ChEMBL_118439
Residue:
99
  
Inhibitor
Name:
BDBM8125
Synonyms:
(3R,3aS,6aR)-hexahydrofuro[2,3-b]furan-3-yl N-[(2S,3R)-4-[(4-aminobenzene)(2-methylpropyl)sulfonamido]-3-hydroxy-1-phenylbutan-2-yl]carbamate Darunavir TMC-114 US10806794, Compound Darunavir
Type:
Small organic molecule
Emp. Form.:
C27H37N3O7S
Mol. Mass.:
547.664
SMILES:
[H][C@@]1(CO[C@@]2([H])OCC[C@@]12[H])OC(=O)N[C@@H](Cc1ccccc1)[C@H](O)CN(CC(C)C)S(=O)(=O)c1ccc(N)cc1
: