Target
3-oxoacyl-[acyl-carrier-protein] synthase 2
Ligand
BDBM50479867
Substrate
Meas. Tech.
ChEMBL_566016 (CHEMBL964115)
IC50
20800±n/a nM
Citation
 Shen, HCDing, FXSingh, SBParthasarathy, GSoisson, SMHa, SNChen, XKodali, SWang, JDorso, KTata, JRHammond, MLMaccoss, MColletti, SL Synthesis and biological evaluation of platensimycin analogs. Bioorg Med Chem Lett 19:1623-7 (2009)  
Target
Name:
3-oxoacyl-[acyl-carrier-protein] synthase 2
Synonyms:
2.3.1.179 3-oxoacyl-[acyl-carrier-protein] synthase II FABF_STAAU fabF
Type:
PROTEIN
Mol. Mass.:
42419.21
Organism:
Staphylococcus aureus
Description:
ChEMBL_100958
Residue:
403
  
Inhibitor
Name:
BDBM50479867
Synonyms:
CHEMBL521849
Type:
Small organic molecule
Emp. Form.:
C25H29NO7
Mol. Mass.:
455.5003
SMILES:
[H][C@@]12C[C@]1([H])C13CC4CC(OC4(C)C1)C3[C@](C)(CCC(=O)Nc1c(O)ccc(C(O)=O)c1O)C2=O
: