Target
Reverse transcriptase
Ligand
BDBM50366799
Substrate
Meas. Tech.
ChEMBL_545151 (CHEMBL1018093)
IC50
>328000±n/a nM
Citation
 Tan, GTPezzuto, JMKinghorn, ADHughes, SH Evaluation of natural products as inhibitors of human immunodeficiency virus type 1 (HIV-1) reverse transcriptase. J Nat Prod 54:143-54 
Target
Name:
Reverse transcriptase
Synonyms:
Type:
Protein
Mol. Mass.:
29598.37
Organism:
Human immunodeficiency virus 1
Description:
Q9WKE8
Residue:
254
  
Inhibitor
Name:
BDBM50366799
Synonyms:
TUBOCURARINE | TUBOCURARINE CHLORIDE
Type:
Small organic molecule
Emp. Form.:
C37H41N2O6
Mol. Mass.:
609.7307
SMILES:
COc1cc2CC[N+](C)(C)[C@@H]3Cc4ccc(O)c(Oc5cc6[C@H](Cc7ccc(Oc(c1O)c23)cc7)N(C)CCc6cc5OC)c4
: