Target
Reverse transcriptase protein
Ligand
BDBM50370476
Substrate
Meas. Tech.
ChEMBL_583930 (CHEMBL1061781)
Kd
2900±n/a nM
Citation
 Zelina, SSheen, CWRadzio, JMellors, JWSluis-Cremer, N Mechanisms by which the G333D mutation in human immunodeficiency virus type 1 Reverse transcriptase facilitates dual resistance to zidovudine and lamivudine. Antimicrob Agents Chemother 52:157-63 (2008)  
Target
Name:
Reverse transcriptase protein
Synonyms:
Reverse Transcriptase Reverse Transcriptase (F61A)
Type:
Protein
Mol. Mass.:
30203.56
Organism:
Human immunodeficiency virus 1
Description:
Q9WJQ2
Residue:
259
  
Inhibitor
Name:
BDBM50370476
Synonyms:
Combivir | ZIDOVUDINE TRIPHOSPHATE
Type:
Small organic molecule
Emp. Form.:
C10H16N5O13P3
Mol. Mass.:
507.181
SMILES:
Cc1cn([C@H]2C[C@H](N=[N+]=[N-])[C@@H](CO[P@@](O)(=O)O[P@@](O)(=O)OP(O)(O)=O)O2)c(=O)[nH]c1=O
: