Target
dTDP-4-dehydrorhamnose 3,5-epimerase
Ligand
BDBM50481568
Substrate
Meas. Tech.
ChEMBL_607670 (CHEMBL1071690)
IC50
120±n/a nM
Citation
 Sivendran, SJones, VSun, DWang, YGrzegorzewicz, AEScherman, MSNapper, ADMcCammon, JALee, REDiamond, SLMcNeil, M Identification of triazinoindol-benzimidazolones as nanomolar inhibitors of the Mycobacterium tuberculosis enzyme TDP-6-deoxy-d-xylo-4-hexopyranosid-4-ulose 3,5-epimerase (RmlC). Bioorg Med Chem 18:896-908 (2010)  
Target
Name:
dTDP-4-dehydrorhamnose 3,5-epimerase
Synonyms:
RMLC_MYCTO rmlC | strM
Type:
Enzyme Catalytic Domain
Mol. Mass.:
22306.68
Organism:
Mycobacterium tuberculosis H37Rv
Description:
gi_15610601
Residue:
202
  
Inhibitor
Name:
BDBM50481568
Synonyms:
CHEMBL592712
Type:
Small organic molecule
Emp. Form.:
C22H20N6OS
Mol. Mass.:
416.499
SMILES:
C=CCn1c2ccccc2c2nnc(SCCCn3c4ccccc4[nH]c3=O)nc12
: