Target
DNA gyrase subunit A/B
Ligand
BDBM50296358
Substrate
Meas. Tech.
ChEMBL_678260 (CHEMBL1280255)
IC50
14000±n/a nM
Citation
 Matrat, SAubry, AMayer, CJarlier, VCambau, E Mutagenesis in the alpha3alpha4 GyrA helix and in the Toprim domain of GyrB refines the contribution of Mycobacterium tuberculosis DNA gyrase to intrinsic resistance to quinolones. Antimicrob Agents Chemother 52:2909-14 (2008)  
Target
Name:
DNA gyrase subunit A/B
Synonyms:
DNA gyrase subunit A/subunit B
Type:
Mol. Mass.:
Description:
ASSAY_ID of ChEMBL is 678260
Components:
This complex has 2 components.
Component 1
Name:
DNA gyrase subunit A
Synonyms:
5.6.2.2 gyrA
Type:
PROTEIN
Mol. Mass.:
97006.20
Organism:
Escherichia coli
Description:
ChEMBL_117105
Residue:
875
  
Component 2
Name:
DNA gyrase subunit B
Synonyms:
Type:
PROTEIN
Mol. Mass.:
89969.34
Organism:
Escherichia coli
Description:
ChEMBL_872079
Residue:
804
  
Inhibitor
Name:
BDBM50296358
Synonyms:
1-Ethyl-6-fluoro-4-oxo-7-piperazin-1-yl-1,4-dihydro-[1,8]naphthyridine-3-carboxylic acid AT-2266 CI-919 PD-107779 enofloxacin
Type:
Small organic molecule
Emp. Form.:
C15H17FN4O3
Mol. Mass.:
320.3189
SMILES:
CCn1cc(C(O)=O)c(=O)c2cc(F)c(nc12)N1CCNCC1
: