Target
Phenylethanolamine N-methyltransferase
Ligand
BDBM50022723
Substrate
Meas. Tech.
ChEBML_142786
Ki
1380000±n/a nM
Citation
 Rafferty, MFWilson, DSMonn, JAKrass, PBorchardt, RTGrunewald, GL Importance of the aromatic ring in adrenergic amines. 7. Comparison of the stereoselectivity of norepinephrine N-methyltransferase for aromatic vs. nonaromatic substrates and inhibitors. J Med Chem 25:1198-204 (1983)  
Target
Name:
Phenylethanolamine N-methyltransferase
Synonyms:
Noradrenaline N-methyltransferase PNMT_BOVIN | PNMTase
Type:
Enzyme
Mol. Mass.:
30916.97
Organism:
Bos taurus (bovine)
Description:
Residue:
283
  
Inhibitor
Name:
BDBM50022723
Synonyms:
(+)-(S)-amphetamine (+)-alpha-methylphenylethylamine (S)-(+)-amphetamine (S)-1-phenyl-2-aminopropane (S)-alpha-methylbenzeneethanamine (alphaS)-alpha-methylbenzeneethanamine Dextroamphetamine dexamphetamine
Type:
Small organic molecule
Emp. Form.:
C9H13N
Mol. Mass.:
135.2062
SMILES:
C[C@H](N)Cc1ccccc1
: