Target
Phenylethanolamine N-methyltransferase
Ligand
BDBM50005246
Substrate
Meas. Tech.
ChEBML_142789
Ki
740000±n/a nM
Citation
 Rafferty, MFBorchardt, RTGrunewald, GL Directional probes of the hydrophobic component of the aromatic ring binding site of norepinephrine N-methyltransferase. J Med Chem 25:1204-8 (1983)  
Target
Name:
Phenylethanolamine N-methyltransferase
Synonyms:
Noradrenaline N-methyltransferase PNMT_BOVIN | PNMTase
Type:
Enzyme
Mol. Mass.:
30916.97
Organism:
Bos taurus (bovine)
Description:
Residue:
283
  
Inhibitor
Name:
BDBM50005246
Synonyms:
1-Phenylpropan-2-amin 1-phenylpropan-2-amine AMPHETAMINE Amfetamine DEXTROAMP SACCHARATE alpha-methylphenylethylamine beta-Phenylisopropylamin beta-phenylisopropylamine | desoxynorephedrine
Type:
Small organic molecule
Emp. Form.:
C9H13N
Mol. Mass.:
135.2062
SMILES:
CC(N)Cc1ccccc1
: