Target
Penicillin-binding protein 1A
Ligand
BDBM50350464
Substrate
Meas. Tech.
ChEMBL_706007 (CHEMBL1662821)
IC50
120±n/a nM
Citation
 Kosowska-Shick, KMcGhee, PAppelbaum, PC Binding of faropenem and other beta-lactam agents to penicillin-binding proteins of pneumococci with various beta-lactam susceptibilities. Antimicrob Agents Chemother 53:2176-80 (2009)  
Target
Name:
Penicillin-binding protein 1A
Synonyms:
2.4.1.129 DD-transpeptidase PBPA_STRPN Penicillin-insensitive transglycosylase Peptidoglycan TGase | ponA
Type:
PROTEIN
Mol. Mass.:
79749.99
Organism:
Streptococcus pneumoniae serotype 4 (strain ATCC BAA-334 / TIGR4)
Description:
ChEMBL_103552
Residue:
719
  
Inhibitor
Name:
BDBM50350464
Synonyms:
AMOXICILLINE Amoxi-Tabs | Amoxicillin
Type:
Small organic molecule
Emp. Form.:
C16H19N3O5S
Mol. Mass.:
365.404
SMILES:
CC1(C)S[C@@H]2[C@H](NC(=O)[C@H](N)c3ccc(O)cc3)C(=O)N2[C@H]1C(O)=O
: