Target
Penicillin-binding protein 2x
Ligand
BDBM50422689
Substrate
Meas. Tech.
ChEMBL_706023 (CHEMBL1662837)
IC50
33.0±n/a nM
Citation
 Kosowska-Shick, KMcGhee, PAppelbaum, PC Binding of faropenem and other beta-lactam agents to penicillin-binding proteins of pneumococci with various beta-lactam susceptibilities. Antimicrob Agents Chemother 53:2176-80 (2009)  
Target
Name:
Penicillin-binding protein 2x
Synonyms:
PBPX_STRPN | pbpX
Type:
PROTEIN
Mol. Mass.:
82307.00
Organism:
Streptococcus pneumoniae
Description:
ChEMBL_653273
Residue:
750
  
Inhibitor
Name:
BDBM50422689
Synonyms:
640/359 | CEFUROXIME
Type:
Small organic molecule
Emp. Form.:
C16H16N4O8S
Mol. Mass.:
424.385
SMILES:
CO\N=C(/C(=O)N[C@H]1[C@H]2SCC(COC(N)=O)=C(N2C1=O)C(O)=O)c1ccco1
: