Target
Probable maltase-glucoamylase 2
Ligand
BDBM50502102
Substrate
Meas. Tech.
ChEMBL_1806312 (CHEMBL4305671)
IC50
100±n/a nM
Citation
 Dhameja, MGupta, P Synthetic heterocyclic candidates as promising ?-glucosidase inhibitors: An overview. Eur J Med Chem 176:343-377 (2019)  
Target
Name:
Probable maltase-glucoamylase 2
Synonyms:
3.2.1.3 Glucoamylase MGAM2 Probable maltase-glucoamylase 2
Type:
PROTEIN
Mol. Mass.:
277932.17
Organism:
Homo sapiens
Description:
ChEMBL_116927
Residue:
2515
  
Inhibitor
Name:
BDBM50502102
Synonyms:
CHEMBL4457996
Type:
Small organic molecule
Emp. Form.:
C18H13Cl3N2O2S
Mol. Mass.:
427.732
SMILES:
COc1ccc(cc1)C(=O)\N=c1/scc(C)n1-c1cc(Cl)c(Cl)cc1Cl
: