Target
Penicillin-binding protein 2B
Ligand
BDBM50022787
Substrate
Meas. Tech.
ChEMBL_725995 (CHEMBL1678591)
IC50
7470±n/a nM
Citation
 Davies, TAHe, WBush, KFlamm, RK Affinity of ceftobiprole for penicillin-binding protein 2b in Streptococcus pneumoniae strains with various susceptibilities to penicillin. Antimicrob Agents Chemother 54:4510-2 (2010)  
Target
Name:
Penicillin-binding protein 2B
Synonyms:
PBP2_STRPN pbp2b penA
Type:
PROTEIN
Mol. Mass.:
73859.38
Organism:
Streptococcus pneumoniae serotype 4 (strain ATCC BAA-334 / TIGR4)
Description:
ChEMBL_103544
Residue:
680
  
Inhibitor
Name:
BDBM50022787
Synonyms:
(+)-3,3-Dimethyl-7-oxo-6-phenylacetylamino-4-thia-1-aza-bicyclo[3.2.0]heptane-2-carboxylic acid(penicillin G) (2S,5R,6R)-3,3-dimethyl-7-oxo-6-(2-phenylacetamido)-4-thia-1-aza-bicyclo[3.2.0]heptane-2-carboxylic acid 3,3-Dimethyl-7-oxo-6-phenylacetylamino-4-thia-1-aza-bicyclo[3.2.0]heptane-2-carboxylic acid anion (Penicillin G) BICILLIN PENICILLIN G PROCAINE PERMAPEN PFIZERPEN-AS | benzylpenicillin
Type:
Small organic molecule
Emp. Form.:
C16H18N2O4S
Mol. Mass.:
334.39
SMILES:
CC1(C)S[C@@H]2[C@H](NC(=O)Cc3ccccc3)C(=O)N2[C@H]1C(O)=O
: