Target
Reverse transcriptase protein
Ligand
BDBM50138406
Substrate
Meas. Tech.
ChEMBL_768886 (CHEMBL1832053)
Kd
18000±n/a nM
Citation
 Zhang, HWDetorio, MHerman, BDSolomon, SBassit, LNettles, JHObikhod, ATao, SJMellors, JWSluis-Cremer, NCoats, SJSchinazi, RF Synthesis, antiviral activity, cytotoxicity and cellular pharmacology of l-3'-azido-2',3'-dideoxypurine nucleosides. Eur J Med Chem 46:3832-44 (2011)  
Target
Name:
Reverse transcriptase protein
Synonyms:
Reverse Transcriptase Reverse Transcriptase (F61A)
Type:
Protein
Mol. Mass.:
30203.56
Organism:
Human immunodeficiency virus 1
Description:
Q9WJQ2
Residue:
259
  
Inhibitor
Name:
BDBM50138406
Synonyms:
3TC Triphosphate LAMIVUDINE [(2R,5S)-5-(4-amino-2-oxopyrimidin-1(2H)-yl)-1,3-oxathiolan-2-yl]methyl tetrahydrogen triphosphate | [[[5-(4-amino-2-oxo-1H-pyrimidin-1-yl)-1,3-oxathiolan-2-yl]methoxy-hydroxy-phosphoryl]oxy-hydroxy-phosphoryl]oxyphosphonic acid
Type:
Small organic molecule
Emp. Form.:
C8H14N3O12P3S
Mol. Mass.:
469.196
SMILES:
Nc1ccn([C@@H]2CS[C@H](COP(O)(=O)OP(O)(=O)OP(O)(O)=O)O2)c(=O)n1
: