Target
2-amino-4-hydroxy-6-hydroxymethyldihydropteridine pyrophosphokinase
Ligand
BDBM50484526
Substrate
Meas. Tech.
ChEMBL_791582 (CHEMBL1930719)
IC50
>100000±n/a nM
Citation
 Shi, GShaw, GLiang, YHSubburaman, PLi, YWu, YYan, HJi, X Bisubstrate analogue inhibitors of 6-hydroxymethyl-7,8-dihydropterin pyrophosphokinase: New design with improved properties. Bioorg Med Chem 20:47-57 (2012)  
Target
Name:
2-amino-4-hydroxy-6-hydroxymethyldihydropteridine pyrophosphokinase
Synonyms:
2-amino-4-hydroxy-6-hydroxymethyldihydropteridine pyrophosphokinase 7,8-dihydro-6-hydroxymethylpterin-pyrophosphokinase HPPK_ECOLI PPPK | folK
Type:
PROTEIN
Mol. Mass.:
18075.55
Organism:
Escherichia coli (strain K12)
Description:
ChEMBL_108237
Residue:
159
  
Inhibitor
Name:
BDBM50484526
Synonyms:
CHEMBL1928284
Type:
Small organic molecule
Emp. Form.:
C24H32N12O4S
Mol. Mass.:
584.654
SMILES:
Nc1nc2ncc(CNCCN3CCC(CC3)SC[C@H]3O[C@H]([C@H](O)[C@@H]3O)n3cnc4c(N)ncnc34)nc2c(=O)[nH]1
: