Target
Neuronal acetylcholine receptor subunit alpha-4/beta-2
Ligand
BDBM50484597
Substrate
Meas. Tech.
ChEMBL_797245 (CHEMBL1942646)
Ki
0.200000±n/a nM
Citation
 Scanio, MJShi, LBunnelle, WHAnderson, DJHelfrich, RJMalysz, JThorin-Hagene, KKVan Handel, CEMarsh, KCLee, CHGopalakrishnan, M Structure-activity studies of diazabicyclo[3.3.0]octane-substituted pyrazines and pyridines as potent ?4?2 nicotinic acetylcholine receptor ligands. J Med Chem 54:7678-92 (2011)  
Target
Name:
Neuronal acetylcholine receptor subunit alpha-4/beta-2
Synonyms:
Neuronal acetylcholine receptor alpha4/beta2 Neuronal acetylcholine receptor; alpha4/beta2
Type:
Mol. Mass.:
Description:
Components:
This complex has 0 components.
Component 1
Name:
Neuronal acetylcholine receptor subunit alpha-4
Synonyms:
ACHA4_RAT Cholinergic, Nicotinic Alpha4Beta2 Chrna4 Neuronal acetylcholine receptor (alpha4beta2 nAChR) Neuronal acetylcholine receptor subunit alpha 4 beta 2 | Neuronal acetylcholine receptor subunit alpha-4
Type:
Enzyme
Mol. Mass.:
70196.44
Organism:
Rattus norvegicus (Rat)
Description:
P09483
Residue:
630
  
Component 2
Name:
Neuronal acetylcholine receptor subunit beta-2
Synonyms:
ACHB2_RAT Chrnb2 Neuronal acetylcholine receptor non-alpha-1 chain
Type:
Enzyme
Mol. Mass.:
56910.32
Organism:
Rattus norvegicus (Rat)
Description:
P12390
Residue:
500
  
Inhibitor
Name:
BDBM50484597
Synonyms:
CHEMBL1939310
Type:
Small organic molecule
Emp. Form.:
C18H19ClN4O
Mol. Mass.:
342.823
SMILES:
[H][C@@]12CNC[C@]1([H])CN(C2)c1cncc(c1)C(=O)Nc1ccc(Cl)cc1
: