Target
UDP-3-O-acyl-N-acetylglucosamine deacetylase
Ligand
BDBM50484904
Substrate
Meas. Tech.
ChEMBL_810002 (CHEMBL2015111)
IC50
0.400000±n/a nM
Citation
 Warmus, JSQuinn, CLTaylor, CMurphy, STJohnson, TALimberakis, COrtwine, DBronstein, JPagano, PKnafels, JDLightle, SMochalkin, IBrideau, RPodoll, T Structure based design of an in vivo active hydroxamic acid inhibitor of P. aeruginosa LpxC. Bioorg Med Chem Lett 22:2536-43 (2012)  
Target
Name:
UDP-3-O-acyl-N-acetylglucosamine deacetylase
Synonyms:
LPXC_PSEAE UDP-3-O-[3-hydroxymyristoyl] N-acetylglucosamine deacetylase UDP-3-O-[3-hydroxymyristoyl] N-acetylglucosamine deacetylase (LpxC) UDP-3-O-acyl-GlcNAc deacetylase (LpxC) lpxC
Type:
Enzyme
Mol. Mass.:
33428.15
Organism:
Pseudomonas aeruginosa
Description:
P47205
Residue:
303
  
Inhibitor
Name:
BDBM50484904
Synonyms:
CHEMBL2012203
Type:
Small organic molecule
Emp. Form.:
C20H20N2O5
Mol. Mass.:
368.3832
SMILES:
C[C@](OCc1ccc(cc1)-c1ccccc1)([C@@H](O)c1ccon1)C(=O)NO
: