Target
Solute carrier family 15 member 2
Ligand
BDBM50370586
Substrate
Meas. Tech.
ChEMBL_838486 (CHEMBL2076057)
Ki
1340000±n/a nM
Citation
 Terada, TSaito, HMukai, MInui, K Recognition of beta-lactam antibiotics by rat peptide transporters, PEPT1 and PEPT2, in LLC-PK1 cells. Am J Physiol 273:706-11 (1997)  
Target
Name:
Solute carrier family 15 member 2
Synonyms:
Oligopeptide transporter, kidney isoform S15A2_RAT | Slc15a2
Type:
PROTEIN
Mol. Mass.:
81331.63
Organism:
Rattus norvegicus
Description:
ChEMBL_838253
Residue:
729
  
Inhibitor
Name:
BDBM50370586
Synonyms:
7-(2-(2-amino-4-thiazolyl)-4-carboxy-2-butenoylamino)-3-cephem-4-carboxylic acid CEFTIBUTEN Cedex | SCH-39720
Type:
Small organic molecule
Emp. Form.:
C15H14N4O6S2
Mol. Mass.:
410.425
SMILES:
Nc1nc(cs1)C(=C\CC(O)=O)\C(=O)N[C@H]1[C@H]2SCC=C(N2C1=O)C(O)=O
: