Target
Solute carrier family 15 member 1
Ligand
BDBM50248190
Substrate
Meas. Tech.
ChEMBL_838489 (CHEMBL2076060)
Ki
11900000±n/a nM
Citation
 Terada, TSaito, HMukai, MInui, K Recognition of beta-lactam antibiotics by rat peptide transporters, PEPT1 and PEPT2, in LLC-PK1 cells. Am J Physiol 273:706-11 (1997)  
Target
Name:
Solute carrier family 15 member 1
Synonyms:
Intestinal H(+)/peptide cotransporter Pept1 Proton-coupled dipeptide cotransporter Slc15a1
Type:
PROTEIN
Mol. Mass.:
78933.78
Organism:
Rattus norvegicus
Description:
ChEMBL_1488841
Residue:
710
  
Inhibitor
Name:
BDBM50248190
Synonyms:
CHEBI:3485 Cefdinir FK-482 | Omnicef
Type:
Small organic molecule
Emp. Form.:
C14H13N5O5S2
Mol. Mass.:
395.414
SMILES:
[H][C@]12SCC(C=C)=C(N1C(=O)[C@H]2NC(=O)C(=N/O)\c1csc(N)n1)C(O)=O
: