Target
Solute carrier family 15 member 1
Ligand
BDBM50485554
Substrate
Meas. Tech.
ChEMBL_838264 (CHEMBL2076212)
Ki
8000000±n/a nM
Citation
 Terada, TSawada, KIrie, MSaito, HHashimoto, YInui, K Structural requirements for determining the substrate affinity of peptide transporters PEPT1 and PEPT2. Pflugers Arch 440:679-84 (2000)  
Target
Name:
Solute carrier family 15 member 1
Synonyms:
Intestinal H(+)/peptide cotransporter Pept1 Proton-coupled dipeptide cotransporter Slc15a1
Type:
PROTEIN
Mol. Mass.:
78933.78
Organism:
Rattus norvegicus
Description:
ChEMBL_1488841
Residue:
710
  
Inhibitor
Name:
BDBM50485554
Synonyms:
CHEBI:15727 Polaprezinc Z-103
Type:
Small organic molecule
Emp. Form.:
C9H14N4O3
Mol. Mass.:
226.2325
SMILES:
NCCC(=O)N[C@@H](Cc1cnc[nH]1)C(O)=O
: