Target
Solute carrier family 15 member 2
Ligand
BDBM50240386
Substrate
Meas. Tech.
ChEMBL_838263 (CHEMBL2076211)
Ki
230000±n/a nM
Citation
 Terada, TSawada, KIrie, MSaito, HHashimoto, YInui, K Structural requirements for determining the substrate affinity of peptide transporters PEPT1 and PEPT2. Pflugers Arch 440:679-84 (2000)  
Target
Name:
Solute carrier family 15 member 2
Synonyms:
Oligopeptide transporter, kidney isoform S15A2_RAT | Slc15a2
Type:
PROTEIN
Mol. Mass.:
81331.63
Organism:
Rattus norvegicus
Description:
ChEMBL_838253
Residue:
729
  
Inhibitor
Name:
BDBM50240386
Synonyms:
5-amino-4-oxopentanoic acid AMINOLEVULINIC ACID CHEMBL601 delta-aminolevulinic acid
Type:
Small organic molecule
Emp. Form.:
C5H9NO3
Mol. Mass.:
131.1299
SMILES:
NCC(=O)CCC(O)=O
: