Target
Solute carrier family 15 member 1
Ligand
BDBM50188512
Substrate
Meas. Tech.
ChEMBL_838264 (CHEMBL2076212)
Ki
8000000±n/a nM
Citation
 Terada, TSawada, KIrie, MSaito, HHashimoto, YInui, K Structural requirements for determining the substrate affinity of peptide transporters PEPT1 and PEPT2. Pflugers Arch 440:679-84 (2000)  
Target
Name:
Solute carrier family 15 member 1
Synonyms:
Intestinal H(+)/peptide cotransporter Pept1 Proton-coupled dipeptide cotransporter Slc15a1
Type:
PROTEIN
Mol. Mass.:
78933.78
Organism:
Rattus norvegicus
Description:
ChEMBL_1488841
Residue:
710
  
Inhibitor
Name:
BDBM50188512
Synonyms:
CHEMBL379332 | Lys-Lys
Type:
Small organic molecule
Emp. Form.:
C12H26N4O3
Mol. Mass.:
274.3598
SMILES:
NCCCC[C@H](N)C(=O)N[C@@H](CCCCN)C(O)=O
: