Target
Solute carrier family 15 member 1
Ligand
BDBM50188492
Substrate
Meas. Tech.
ChEMBL_838264 (CHEMBL2076212)
Ki
110000±n/a nM
Citation
 Terada, TSawada, KIrie, MSaito, HHashimoto, YInui, K Structural requirements for determining the substrate affinity of peptide transporters PEPT1 and PEPT2. Pflugers Arch 440:679-84 (2000)  
Target
Name:
Solute carrier family 15 member 1
Synonyms:
Intestinal H(+)/peptide cotransporter Pept1 Proton-coupled dipeptide cotransporter Slc15a1
Type:
PROTEIN
Mol. Mass.:
78933.78
Organism:
Rattus norvegicus
Description:
ChEMBL_1488841
Residue:
710
  
Inhibitor
Name:
BDBM50188492
Synonyms:
(S)-2-(2-Amino-acetylamino)-4-methyl-pentanoic acid CHEMBL56119 | Gly-Leu
Type:
Small organic molecule
Emp. Form.:
C8H16N2O3
Mol. Mass.:
188.2242
SMILES:
CC(C)C[C@H](NC(=O)CN)C(O)=O
: