Target
Solute carrier family 22 member 3
Ligand
BDBM39344
Substrate
Meas. Tech.
ChEMBL_838723 (CHEMBL2078549)
Ki
738000±n/a nM
Citation
 Wu, XHuang, WGanapathy, MEWang, HKekuda, RConway, SJLeibach, FHGanapathy, V Structure, function, and regional distribution of the organic cation transporter OCT3 in the kidney. Am J Physiol Renal Physiol 279:449-58 (2000)  
Target
Name:
Solute carrier family 22 member 3
Synonyms:
EMT Extraneuronal monoamine transporter Organic cation transporter 3 SLC22A3
Type:
PROTEIN
Mol. Mass.:
61292.57
Organism:
Homo sapiens (Human)
Description:
ChEMBL_934315
Residue:
556
  
Inhibitor
Name:
BDBM39344
Synonyms:
4-amino-N-[2-(diethylamino)ethyl]benzamide;hydrochloride MLS000069436 PROCAINAMIDE HYDROCHLORIDE cid_66068
Type:
Small organic molecule
Emp. Form.:
C13H21N3O
Mol. Mass.:
235.3253
SMILES:
CCN(CC)CCNC(=O)c1ccc(N)cc1
: