Target
Multidrug resistance-associated protein 1
Ligand
BDBM50485596
Substrate
Meas. Tech.
ChEMBL_836476 (CHEMBL2077006)
Ki
300±n/a nM
Citation
 Leier, IJedlitschky, GBuchholz, UCenter, MCole, SPDeeley, RGKeppler, D ATP-dependent glutathione disulphide transport mediated by the MRP gene-encoded conjugate export pump. Biochem J 314:433-7 (1996)  
Target
Name:
Multidrug resistance-associated protein 1
Synonyms:
7.6.2.2 ABCC1 ATP-binding cassette, sub-family C, member 1 isoform 1 LTC4 transporter MRP MRP1_HUMAN
Type:
Mol. Mass.:
171597.72
Organism:
Homo sapiens (Human)
Description:
P33527
Residue:
1531
  
Inhibitor
Name:
BDBM50485596
Synonyms:
LEUKOTRIEN C4 | Leukotriene C4
Type:
Small organic molecule
Emp. Form.:
C30H47N3O9S
Mol. Mass.:
625.774
SMILES:
CCCCC\C=C/C\C=C/C=C/C=C/[C@@H](SC[C@@H](NC(=O)CC[C@H](N)C(O)=O)C(=O)NCC(O)=O)[C@@H](O)CCCC(O)=O
: