Target
Bile salt export pump
Ligand
BDBM50375595
Substrate
Meas. Tech.
ChEMBL_836611 (CHEMBL2077352)
Ki
28000±n/a nM
Citation
 Byrne, JAStrautnieks, SSMieli-Vergani, GHiggins, CFLinton, KJThompson, RJ The human bile salt export pump: characterization of substrate specificity and identification of inhibitors. Gastroenterology 123:1649-58 (2002)  
Target
Name:
Bile salt export pump
Synonyms:
ABCB11 ATP-binding cassette sub-family B member 11 Bile Salt Export Pump, BSEP Bile salt export pump (BSEP)
Type:
Protein
Mol. Mass.:
146405.49
Organism:
Homo sapiens (Human)
Description:
O95342
Residue:
1321
  
Inhibitor
Name:
BDBM50375595
Synonyms:
CHEMBL185878 | Taurochenodeoxycholate
Type:
Small organic molecule
Emp. Form.:
C26H45NO6S
Mol. Mass.:
499.704
SMILES:
C[C@H](CCC(=O)NCCS(O)(=O)=O)[C@H]1CC[C@H]2[C@@H]3[C@H](O)C[C@@H]4C[C@H](O)CC[C@]4(C)[C@H]3CC[C@]12C
: