Target
ATP-dependent translocase ABCB1
Ligand
BDBM50368352
Substrate
Meas. Tech.
ChEMBL_838522 (CHEMBL2078150)
Ki
2500±n/a nM
Citation
 Gao, JMurase, OSchowen, RLAubé, JBorchardt, RT A functional assay for quantitation of the apparent affinities of ligands of P-glycoprotein in Caco-2 cells. Pharm Res 18:171-6 (2001)  
Target
Name:
ATP-dependent translocase ABCB1
Synonyms:
ABCB1 MDR1_HUMAN Multidrug resistance protein 1 P-glycoprotein (P-gp) PGY1
Type:
Protein
Mol. Mass.:
141503.50
Organism:
Homo sapiens (Human)
Description:
P08183
Residue:
1280
  
Inhibitor
Name:
BDBM50368352
Synonyms:
Cerubidine | DAUNORUBICIN
Type:
Small organic molecule
Emp. Form.:
C27H29NO10
Mol. Mass.:
527.5199
SMILES:
COc1cccc2C(=O)c3c(O)c4C[C@](O)(C[C@H](O[C@H]5C[C@H](N)[C@H](O)[C@H](C)O5)c4c(O)c3C(=O)c12)C(C)=O
: