Target
ATP-binding cassette sub-family C member 2
Ligand
BDBM58924
Substrate
Meas. Tech.
ChEMBL_836159 (CHEMBL2075058)
Ki
5500±n/a nM
Citation
 Bode, KADonner, MGLeier, IKeppler, D Inhibition of transport across the hepatocyte canalicular membrane by the antibiotic fusidate. Biochem Pharmacol 64:151-8 (2002)  
Target
Name:
ATP-binding cassette sub-family C member 2
Synonyms:
ATP-binding cassette sub-family C member 2 Canalicular multidrug resistance protein Cmoat MRP2_RAT Multidrug resistance-associated protein 2
Type:
PROTEIN
Mol. Mass.:
173415.22
Organism:
Rattus norvegicus
Description:
ChEMBL_1455464
Residue:
1541
  
Inhibitor
Name:
BDBM58924
Synonyms:
(2Z)-2-[(3R,4S,5S,8S,9S,10S,11R,13R,14S,16S)-16-acetoxy-3,11-dihydroxy-4,8,10,14-tetramethyl-2,3,4,5,6,7,9,11,12,13,15,16-dodecahydro-1H-cyclopenta[a]phenanthren-17-ylidene]-6-methyl-hept-5-enoic acid (2Z)-2-[(3R,4S,5S,8S,9S,10S,11R,13R,14S,16S)-16-acetyloxy-3,11-dihydroxy-4,8,10,14-tetramethyl-2,3,4,5,6,7,9,11,12,13,15,16-dodecahydro-1H-cyclopenta[a]phenanthren-17-ylidene]-6-methylhept-5-enoic acid Fusidic acid SMR000857101 | cid_3000226
Type:
Small organic molecule
Emp. Form.:
C31H48O6
Mol. Mass.:
516.7092
SMILES:
[#6]-[#6@@H]-1-[#6@H](-[#8])-[#6]-[#6][C@@]2([#6])[#6@H]-1-[#6]-[#6][C@@]1([#6])[#6@H]2-[#6@H](-[#8])-[#6]-[#6@H]2\[#6](-[#6@H](-[#6][C@]12[#6])-[#8]-[#6](-[#6])=O)=[#6](/[#6]-[#6]\[#6]=[#6](\[#6])-[#6])-[#6](-[#8])=O
: