Target
ATP-binding cassette sub-family C member 2
Ligand
BDBM50391002
Substrate
Meas. Tech.
ChEMBL_836175 (CHEMBL2075074)
Ki
3840±n/a nM
Citation
 Niinuma, KTakenaka, OHorie, TKobayashi, KKato, YSuzuki, HSugiyama, Y Kinetic analysis of the primary active transport of conjugated metabolites across the bile canalicular membrane: comparative study of S-(2,4-dinitrophenyl)-glutathione and 6-hydroxy-5,7-dimethyl-2-methylamino-4-(3-pyridylmethyl)benzothiazole glucuronide. J Pharmacol Exp Ther 282:866-72 (1997) Target
Name:
ATP-binding cassette sub-family C member 2
Synonyms:
ATP-binding cassette sub-family C member 2 Canalicular multidrug resistance protein Cmoat MRP2_RAT Multidrug resistance-associated protein 2
Type:
PROTEIN
Mol. Mass.:
173415.22
Organism:
Rattus norvegicus
Description:
ChEMBL_1455464
Residue:
1541
  
Inhibitor
Name:
BDBM50391002
Synonyms:
CHEMBL2074599
Type:
Small organic molecule
Emp. Form.:
C22H25N3O7S
Mol. Mass.:
475.515
SMILES:
CNc1nc2c(Cc3cccnc3)c(C)c(O[C@@H]3O[C@@H]([C@@H](O)[C@H](O)[C@H]3O)C(O)=O)c(C)c2s1
: