Target
Solute carrier family 15 member 1
Ligand
BDBM50162073
Substrate
Meas. Tech.
ChEMBL_836467 (CHEMBL2076907)
Ki
2700000±n/a nM
Citation
 Sawada, KTerada, TSaito, HHashimoto, YInui, KI Recognition of L-amino acid ester compounds by rat peptide transporters PEPT1 and PEPT2. J Pharmacol Exp Ther 291:705-9 (1999) Target
Name:
Solute carrier family 15 member 1
Synonyms:
Intestinal H(+)/peptide cotransporter Pept1 Proton-coupled dipeptide cotransporter Slc15a1
Type:
PROTEIN
Mol. Mass.:
78933.78
Organism:
Rattus norvegicus
Description:
ChEMBL_1488841
Residue:
710
  
Inhibitor
Name:
BDBM50162073
Synonyms:
(S)-2-((2-amino-6-oxo-3H-purin-9(6H)-yl)methoxy)ethyl 2-amino-3-methylbutanoate CHEMBL1349 | VALACYCLOVIR
Type:
Small organic molecule
Emp. Form.:
C13H20N6O4
Mol. Mass.:
324.3357
SMILES:
CC(C)[C@H](N)C(=O)OCCOCn1cnc2c1nc(N)[nH]c2=O
: