Target
Solute carrier family 15 member 2
Ligand
BDBM50370586
Substrate
Meas. Tech.
ChEMBL_835996 (CHEMBL2077228)
Ki
380000±n/a nM
Citation
 Ganapathy, MEPrasad, PDMackenzie, BGanapathy, VLeibach, FH Interaction of anionic cephalosporins with the intestinal and renal peptide transporters PEPT 1 and PEPT 2. Biochim Biophys Acta 1324:296-308 (1997)  
Target
Name:
Solute carrier family 15 member 2
Synonyms:
Oligopeptide transporter, kidney isoform S15A2_RAT | Slc15a2
Type:
PROTEIN
Mol. Mass.:
81331.63
Organism:
Rattus norvegicus
Description:
ChEMBL_838253
Residue:
729
  
Inhibitor
Name:
BDBM50370586
Synonyms:
7-(2-(2-amino-4-thiazolyl)-4-carboxy-2-butenoylamino)-3-cephem-4-carboxylic acid CEFTIBUTEN Cedex | SCH-39720
Type:
Small organic molecule
Emp. Form.:
C15H14N4O6S2
Mol. Mass.:
410.425
SMILES:
Nc1nc(cs1)C(=C\CC(O)=O)\C(=O)N[C@H]1[C@H]2SCC=C(N2C1=O)C(O)=O
: