Target
Solute carrier family 15 member 2
Ligand
BDBM50350467
Substrate
Meas. Tech.
ChEMBL_836464 (CHEMBL2076904)
Ki
2800±n/a nM
Citation
 Ganapathy, MEBrandsch, MPrasad, PDGanapathy, VLeibach, FH Differential recognition of beta -lactam antibiotics by intestinal and renal peptide transporters, PEPT 1 and PEPT 2. J Biol Chem 270:25672-7 (1995)  
Target
Name:
Solute carrier family 15 member 2
Synonyms:
Kidney H(+)/peptide cotransporter PEPT2 S15A2_HUMAN | SLC15A2
Type:
PROTEIN
Mol. Mass.:
81795.62
Organism:
Homo sapiens (Human)
Description:
ChEMBL_762551
Residue:
729
  
Inhibitor
Name:
BDBM50350467
Synonyms:
BL-S578 Cefadrops
Type:
Small organic molecule
Emp. Form.:
C16H17N3O5S
Mol. Mass.:
363.388
SMILES:
CC1=C(N2[C@H](SC1)[C@H](NC(=O)[C@H](N)c1ccc(O)cc1)C2=O)C(O)=O
: