Target
Genome polyprotein
Ligand
BDBM50485814
Substrate
Meas. Tech.
ChEMBL_858568 (CHEMBL2166013)
IC50
180±n/a nM
Citation
 Kim, BKKim, JHKim, NRLee, WGLee, SDYun, SHJeon, ESKim, YC Development of anti-coxsackievirus agents targeting 3C protease. Bioorg Med Chem Lett 22:6952-6 (2012)  
Target
Name:
Genome polyprotein
Synonyms:
3C-like proteinase (CVB3 3Cpro) P1A P1C P2A P2C P3B P3D-POL Picornain 3C Protease 2A Protein 2A Protein 2C Protein 3B Protein VP1 Protein VP3 RNA-directed RNA polymerase 3D-POL VPg Virion protein 2 Virion protein 4
Type:
Enzyme
Mol. Mass.:
243464.96
Organism:
Coxsackievirus B3 (strain Nancy)
Description:
P03313
Residue:
2185
  
Inhibitor
Name:
BDBM50485814
Synonyms:
CHEMBL2164927
Type:
Small organic molecule
Emp. Form.:
C34H38FN7O7
Mol. Mass.:
675.7066
SMILES:
CC(C)[C@H](NC(=O)c1cc(C)on1)C(=O)N[C@@H](Cc1ccc(F)cc1)C(=O)N[C@H](CCC(N)=O)\C=C\C(=O)OCc1ccc2[nH]ncc2c1
: