Target
Streptavidin
Ligand
BDBM14487
Substrate
Meas. Tech.
ChEMBL_884974 (CHEMBL2210840)
Kd
168000±n/a nM
Citation
 Bing, TChang, TQi, CZhang, NLiu, XShangguan, D Specific interactions between adenosine and streptavidin/avidin. Bioorg Med Chem Lett 22:7052-5 (2012)  
Target
Name:
Streptavidin
Synonyms:
SAV_STRAV
Type:
Protein
Mol. Mass.:
18835.54
Organism:
Streptomyces avidinii
Description:
P22629
Residue:
183
  
Inhibitor
Name:
BDBM14487
Synonyms:
(2R,3R,4S,5R)-2-(6-amino-9H-purin-9-yl)-5-(hydroxymethyl)oxolane-3,4-diol Adenosine N6-Methylado cid_191 | cid_60961
Type:
Nucleoside or nucleotide
Emp. Form.:
C10H13N5O4
Mol. Mass.:
267.2413
SMILES:
Nc1ncnc2n(cnc12)[C@@H]1O[C@H](CO)[C@@H](O)[C@H]1O
: