Target
Polyphenol oxidase 2
Ligand
BDBM50486225
Substrate
Meas. Tech.
ChEMBL_892185 (CHEMBL3051431)
IC50
24000±n/a nM
Citation
 Ford, KAGulevich, AGSwenson, TLCasida, JE Neonicotinoid insecticides: oxidative stress in planta and metallo-oxidase inhibition. J Agric Food Chem 59:4860-7 (2011)  
Target
Name:
Polyphenol oxidase 2
Synonyms:
Monophenol monooxygenase PPO2 Tyrosinase
Type:
Protein
Mol. Mass.:
63923.66
Organism:
Agaricus bisporus (Common mushroom)
Description:
O42713
Residue:
556
  
Inhibitor
Name:
BDBM50486225
Synonyms:
POTASSIUM CYANIDE
Type:
Small organic molecule
Emp. Form.:
CKN
Mol. Mass.:
65.1157
SMILES:
[K;v0+].[C-]#N
: