Target
Aldehyde oxidase 1
Ligand
BDBM60953
Substrate
Meas. Tech.
ChEMBL_892184 (CHEMBL3051430)
IC50
660000±n/a nM
Citation
 Ford, KAGulevich, AGSwenson, TLCasida, JE Neonicotinoid insecticides: oxidative stress in planta and metallo-oxidase inhibition. J Agric Food Chem 59:4860-7 (2011)  
Target
Name:
Aldehyde oxidase 1
Synonyms:
AO AOXA_RABIT Retinal oxidase
Type:
PROTEIN
Mol. Mass.:
147140.36
Organism:
Oryctolagus cuniculus
Description:
ChEMBL_696368
Residue:
1334
  
Inhibitor
Name:
BDBM60953
Synonyms:
BDBM50139371 | benzaldehyde
Type:
Emp. Form.:
C7H6O
Mol. Mass.:
106.1219
SMILES:
O=Cc1ccccc1
: