Target
Aldehyde oxidase 1
Ligand
BDBM50486230
Substrate
Meas. Tech.
ChEMBL_892184 (CHEMBL3051430)
IC50
720000±n/a nM
Citation
 Ford, KAGulevich, AGSwenson, TLCasida, JE Neonicotinoid insecticides: oxidative stress in planta and metallo-oxidase inhibition. J Agric Food Chem 59:4860-7 (2011)  
Target
Name:
Aldehyde oxidase 1
Synonyms:
AO AOXA_RABIT Retinal oxidase
Type:
PROTEIN
Mol. Mass.:
147140.36
Organism:
Oryctolagus cuniculus
Description:
ChEMBL_696368
Residue:
1334
  
Inhibitor
Name:
BDBM50486230
Synonyms:
6-CHLORONICOTINALDEHYDE
Type:
Small organic molecule
Emp. Form.:
C6H4ClNO
Mol. Mass.:
141.555
SMILES:
Clc1ccc(C=O)cn1
: