Target
Aldehyde oxidase 1
Ligand
BDBM50486224
Substrate
Meas. Tech.
ChEMBL_892184 (CHEMBL3051430)
IC50
890000±n/a nM
Citation
 Ford, KAGulevich, AGSwenson, TLCasida, JE Neonicotinoid insecticides: oxidative stress in planta and metallo-oxidase inhibition. J Agric Food Chem 59:4860-7 (2011)  
Target
Name:
Aldehyde oxidase 1
Synonyms:
AO AOXA_RABIT Retinal oxidase
Type:
PROTEIN
Mol. Mass.:
147140.36
Organism:
Oryctolagus cuniculus
Description:
ChEMBL_696368
Residue:
1334
  
Inhibitor
Name:
BDBM50486224
Synonyms:
THIAZOLE-5-CARBALDEHYDE
Type:
Small organic molecule
Emp. Form.:
C4H3NOS
Mol. Mass.:
113.138
SMILES:
O=Cc1cncs1
: