Target
Dihydroorotate dehydrogenase (quinone), mitochondrial
Ligand
BDBM50018011
Substrate
Meas. Tech.
ChEMBL_899894 (CHEMBL3062604)
IC50
190546±n/a nM
Citation
  TBA Med Chem Res 20:321-332 (2011)    Article 
Target
Name:
Dihydroorotate dehydrogenase (quinone), mitochondrial
Synonyms:
DHOdehase Dihydroorotate dehydrogenase homolog PYRD_PLAF7
Type:
Enzyme
Mol. Mass.:
65581.88
Organism:
Plasmodium falciparum (isolate 3D7)
Description:
Q08210
Residue:
569
  
Inhibitor
Name:
BDBM50018011
Synonyms:
Aubagio HMR-1726 | TERIFLUNOMIDE
Type:
Small organic molecule
Emp. Form.:
C12H9F3N2O2
Mol. Mass.:
270.2073
SMILES:
C\C(O)=C(/C#N)C(=O)Nc1ccc(cc1)C(F)(F)F
: