Target
Acetolactate synthase, chloroplastic
Ligand
BDBM50487177
Substrate
Meas. Tech.
ChEMBL_908731 (CHEMBL3066158)
Ki
1610±n/a nM
Citation
 Chen, CNChen, QLiu, YCZhu, XLNiu, CWXi, ZYang, GF Syntheses and herbicidal activity of new triazolopyrimidine-2-sulfonamides as acetohydroxyacid synthase inhibitor. Bioorg Med Chem 18:4897-904 (2010)  
Target
Name:
Acetolactate synthase, chloroplastic
Synonyms:
AHAS Acetolactate synthase ILVB_ARATH | TZP5
Type:
PROTEIN
Mol. Mass.:
72585.19
Organism:
Arabidopsis thaliana
Description:
ChEMBL_934103
Residue:
670
  
Inhibitor
Name:
BDBM50487177
Synonyms:
CHEMBL2251959
Type:
Small organic molecule
Emp. Form.:
C14H12ClN5O5S
Mol. Mass.:
397.794
SMILES:
COC(=O)c1cccc(Cl)c1NS(=O)(=O)c1nc2nc(OC)ccn2n1
: