Target
Soluble acetylcholine receptor
Ligand
BDBM50472282
Substrate
Meas. Tech.
ChEMBL_908843 (CHEMBL3067865)
Ki
0.600000±n/a nM
Citation
 Tomizawa, MCasida, JE Unique neonicotinoid binding conformations conferring selective receptor interactions. J Agric Food Chem 59:2825-8 (2011)  
Target
Name:
Soluble acetylcholine receptor
Synonyms:
Acetylcholine Binding protein | Soluble acetylcholine receptor
Type:
Mol. Mass.:
26560.08
Organism:
Aplysia Californica
Description:
Q8WSF8
Residue:
236
  
Inhibitor
Name:
BDBM50472282
Synonyms:
descyanothiacloprid
Type:
Small organic molecule
Emp. Form.:
C9H10ClN3S
Mol. Mass.:
227.714
SMILES:
Clc1ccc(CN2CCSC2=N)cn1
: